Org.apache.spark.sparkexception job aborted due to stage failure - org.apache.spark.SparkException: Job aborted due to stage failure: Task 1 in stage 188.0 failed 4 in Data Engineering a month ago; SparkException: There is no Credential Scope. in Data Governance a month ago

 
Nov 28, 2019 · According to the content of README.md of GitHub repo Azure/azure-cosmosdb-spark as the figure below, you may should switch to use the latest jar file azure-cosmosdb-spark_2.4.0_2.11-1.4.0-uber.jar in it. And the maven repo for Azure CosmosDB Spark has released to 1.4.1 version, as the figure below. . 2e

不知道是什么原因。. (利用 Spark-submit 提交 参数都正常). 但是 集群上的版本是1.5,和2.0都无法跑出来结果,但是1.3就能出结果, 所以目前确定是 Spark 1.5以上的版本对协同过滤算法不兼容引起,具体原因不详。. task倾斜原因比较多,网络io,cpu,mem都有可能造成 ...Solve : org.apache.spark.SparkException: Job aborted due to stage failure Load 7 more related questions Show fewer related questions 0org.apache.spark.SparkException: Job aborted due to stage failure: Task XXX in stage YYY failed 4 times, most recent failure: Lost task XXX in stage YYY (TID ZZZ, ip-xxx-xx-x-xxx.compute.internal, executor NNN): ExecutorLostFailure (executor NNN exited caused by one of the running tasks) Reason: ... 解決方法 理由コードの検索Dec 6, 2018 · 1. "Accept timed out" generally points to a problem with your spark instance. It may be overloaded or not enough resources (memory/cpu) to start your job or it might be a temporary network issue. You can monitor you jobs on Spark UI. Also there is some issue with your code. Caused by: org.apache.spark.SparkException: Job aborted due to stage failure: Aborting TaskSet 0.0 because task 0 (partition 0) cannot run anywhere due to node and executor blacklist.Data collection is indirect, with data being stored both on the JVM side and Python side. While JVM memory can be released once data goes through socket, peak memory usage should account for both. Plain toPandas implementation collects Rows first, then creates Pandas DataFrame locally. This further increases (possibly doubles) memory usage.Nov 12, 2018 · Pyspark. spark.SparkException: Job aborted due to stage failure: Task 0 in stage 15.0 failed 1 times, java.net.SocketException: Connection reset Hot Network Questions Does America, like non-democratic countries like China, also have factions? Nov 10, 2016 · Hi! I run 2 to spark an option SPARK_MAJOR_VERSION=2 pyspark --master yarn --verbose spark starts, I run the SC and get an error, the field in the table exactly there. not the problem SPARK_MAJOR_VERSION=2 pyspark --master yarn --verbose SPARK_MAJOR_VERSION is set to 2, using Spark2 Python 2.7.12 ... Apr 15, 2021 · The copy activity was interrupted part way through as the source database went offline which then caused the failure to complete writing the files properly. These were easily found as they were the most recently modified files. Oct 31, 2022 · I am trying to run a pyspark job but it is failing on RDD collectAndServe method. I do not have any memory issues. I have all updated jars in my jars folder. Python worker is crashing with below er... Pyspark. spark.SparkException: Job aborted due to stage failure: Task 0 in stage 15.0 failed 1 times, java.net.SocketException: Connection reset Hot Network Questions Does America, like non-democratic countries like China, also have factions?: org.apache.spark.SparkException: Job aborted due to stage failure: Serialized task 302987:27 was 139041896 bytes, which exceeds max allowed: spark.akka.frameSize (134217728 bytes) - reserved (204800 bytes).The copy activity was interrupted part way through as the source database went offline which then caused the failure to complete writing the files properly. These were easily found as they were the most recently modified files.The copy activity was interrupted part way through as the source database went offline which then caused the failure to complete writing the files properly. These were easily found as they were the most recently modified files.1. "Accept timed out" generally points to a problem with your spark instance. It may be overloaded or not enough resources (memory/cpu) to start your job or it might be a temporary network issue. You can monitor you jobs on Spark UI. Also there is some issue with your code.Here is the full list of commands creating the list, writing it to HDFS and finally printing out the results on the console using hdfs: spark-shell. After the shell has started you type: val nums = sc.parallelize (List (1,2,3,4,5)) nums.saveAsTextFile ("/tmp/simple_list") :quit. Now we read the data from HDFS (Hadoop File System):1 Answer. PySpark DF are lazy loading. When you call .show () you are asking the prior steps to execute and anyone of them may not work, you just can't see it until you call .show () because they haven't executed. I go back to earlier steps and call .collect () on each operation of the DF. This will at least allow you to isolate where the bad ...Teams. Q&A for work. Connect and share knowledge within a single location that is structured and easy to search. Learn more about TeamsAug 9, 2021 · You need to change this parameter in the cluster configuration. Go into the cluster settings, under Advanced select spark and paste spark.driver.maxResultSize 0 (for unlimited) or whatever the value suits you. Using 0 is not recommended. You should optimize the job by re partitioning. See the links below for more information: https://docs ... org.apache.spark.SparkException: Job aborted due to stage failure: Total size of serialized results of 69 tasks (4.0 GB) is bigger than spark.driver.maxResultSize (4.0 GB) 08-23-2021 07:48 AM. set spark.conf.set ("spark.driver.maxResultSize", "20g") get spark.conf.get ("spark.driver.maxResultSize") // 20g which is expected in notebook , I did ...Check Apache Spark installation on Windows 10 steps. Use different versions of Apache Spark (tried 2.4.3 / 2.4.2 / 2.3.4). Disable firewall windows and antivirus that I have installed. Tried to initialize the SparkContext manually with sc = spark.sparkContext (found this possible solution at this question here in Stackoverflow, didn´t work for ...Feb 23, 2022 · I am running spark jobs using datafactory in azure databricks. My cluster vesion is 9.1 LTS ML (includes Apache Spark 3.1.2, Scala 2.12). I am writing data on azure blob storage. While writing job ... Nov 11, 2021 · 1 Answer. PySpark DF are lazy loading. When you call .show () you are asking the prior steps to execute and anyone of them may not work, you just can't see it until you call .show () because they haven't executed. I go back to earlier steps and call .collect () on each operation of the DF. This will at least allow you to isolate where the bad ... 不知道是什么原因。. (利用 Spark-submit 提交 参数都正常). 但是 集群上的版本是1.5,和2.0都无法跑出来结果,但是1.3就能出结果, 所以目前确定是 Spark 1.5以上的版本对协同过滤算法不兼容引起,具体原因不详。. task倾斜原因比较多,网络io,cpu,mem都有可能造成 ... For Spark jobs submitted with --deploy-mode cluster, run the following command on the master node to find stage failures in the YARN application logs. Replace application_id with the ID of your Spark application (for example, application_1572839353552_0008 ). yarn logs -applicationId application_id | grep "Job aborted due to stage failure" -A 10. Sep 20, 2021 · I've setted up pyspark on google colab using this tutorial from towardsdatascience. It runs well until it fails on trying to use IDF from pyspark.ml.feature import IDF idf = IDF(inputCol='hash', Mar 31, 2019 · org.apache.spark.SparkException: Job aborted due to stage failure: Task in stage failed,Lost task in stage : ExecutorLostFailure (executor 4 lost) Ask Question Asked 4 years, 5 months ago Solution 1. Check your environment variables. You are getting “py4j.protocol.Py4JError: org.apache.spark.api.python.PythonUtils.getEncryptionEnabled does not exist in the JVM” due to Spark environemnt variables are not set right.Nov 1, 2017 · Saved searches Use saved searches to filter your results more quickly Feb 23, 2022 · I am running spark jobs using datafactory in azure databricks. My cluster vesion is 9.1 LTS ML (includes Apache Spark 3.1.2, Scala 2.12). I am writing data on azure blob storage. While writing job ... Nov 11, 2021 · 1 Answer. PySpark DF are lazy loading. When you call .show () you are asking the prior steps to execute and anyone of them may not work, you just can't see it until you call .show () because they haven't executed. I go back to earlier steps and call .collect () on each operation of the DF. This will at least allow you to isolate where the bad ... Solution 1. Check your environment variables. You are getting “py4j.protocol.Py4JError: org.apache.spark.api.python.PythonUtils.getEncryptionEnabled does not exist in the JVM” due to Spark environemnt variables are not set right. Problem Databricks throws an error when fitting a SparkML model or Pipeline: org.apache.spark.SparkException: Job aborted due to stage failure: Task 0 in sJul 17, 2020 · Caused by: org.apache.spark.SparkException: Job aborted due to stage failure: Serialized task 2:0 was 155731289 bytes, which exceeds max allowed: spark.rpc.message.maxSize (134217728 bytes). Consider increasing spark.rpc.message.maxSize or using broadcast variables for large values. Here is the full list of commands creating the list, writing it to HDFS and finally printing out the results on the console using hdfs: spark-shell. After the shell has started you type: val nums = sc.parallelize (List (1,2,3,4,5)) nums.saveAsTextFile ("/tmp/simple_list") :quit. Now we read the data from HDFS (Hadoop File System):1 Answer. PySpark DF are lazy loading. When you call .show () you are asking the prior steps to execute and anyone of them may not work, you just can't see it until you call .show () because they haven't executed. I go back to earlier steps and call .collect () on each operation of the DF. This will at least allow you to isolate where the bad ...Dec 29, 2018 · Teams. Q&A for work. Connect and share knowledge within a single location that is structured and easy to search. Learn more about Teams I am trying to run a pyspark job but it is failing on RDD collectAndServe method. I do not have any memory issues. I have all updated jars in my jars folder. Python worker is crashing with below er...Viewed 6k times. 4. I'm processing large spark dataframe in databricks and when I'm trying to write the final dataframe into csv format it gives me the following error: org.apache.spark.SparkException: Job aborted. #Creating a data frame with entire date seuence for each user df=pd.DataFrame ( {'transaction_date':dt_range2,'msno':msno1}) from ...Use the DF transformations to create the statistics you need, THEN call collect/show to get the result back to the driver. That way you are only downloading the stats, not the full data.at Source 'source': org.apache.spark.SparkException: Job aborted due to stage failure: Task 3 in stage 15.0 failed 1 times, most recent failure: Lost task 3.0 in stage 15.0 (TID 35, vm-85b29723, executor 1): java.nio.charset.MalformedInputException: Input length = 1Mar 23, 2014 · FYI in Spark 2.4 a lot of you will probably encounter this issue. Kryo serialization has gotten better but in many cases you cannot use spark.kryo.unsafe=true or the naive kryo serializer. For a quick fix try changing the following in your Spark configuration spark.kryo.unsafe="false" OR. spark.serializer="org.apache.spark.serializer ... Part of Microsoft Azure Collective. 0. Caused by: org.apache.spark.SparkException: Job aborted due to stage failure: Task 5 in stage 76.0 failed 4 times, most recent failure: Lost task 5.3 in stage 76.0 (TID 2334) (10.139.64.5 executor 6): com.databricks.sql.io.FileReadException: Error while reading file <File_Path> It is possible the ...Go into the cluster settings, under Advanced select spark and paste spark.driver.maxResultSize 0 (for unlimited) or whatever the value suits you. Using 0 is not recommended. You should optimize the job by re partitioning. For more details, refer "Spark Configurations - Application Properties". Hope this helps. Do let us know if you any further ...May 8, 2021 · org.apache.spark.SparkException: Job aborted due to stage failure: Task 3 in stage 6.0 failed 1 times, most recent failure: Lost task 3.0 in stage 6.0 (TID 62, LAPTOP-H7MM9952, executor driver): org.apache.spark.SparkException: Task failed while writing rows. org.apache.spark.SparkException: Job aborted due to stage failure: ShuffleMapStage 20 (repartition at data_prep.scala:87) has failed the maximum allowable number of times: 4. Most recent failure reason: org.apache.spark.shuffle.MetadataFetchFailedException: Missing an output location for shuffle 9Stack Overflow Public questions & answers; Stack Overflow for Teams Where developers & technologists share private knowledge with coworkers; Talent Build your employer brandWhen a stage failure occurs, the Spark driver logs report an exception similar to the following: org.apache.spark.SparkException: Job aborted due to stage failure: Task XXX in stage YYY failed 4 times, most recent failure: Lost task XXX in stage YYY (TID ZZZ, ip-xxx-xx-x-xxx.compute.internal, executor NNN): ExecutorLostFailure (executor NNN ...Dec 29, 2020 · When I run the demo : from pyspark.ml.linalg import Vectors import tempfile conf = SparkConf().setAppName('ansonzhou_test').setAll([ ('spark.executor.memory', '8g ... org.apache.spark.SparkException: Job aborted due to stage failure: Task 3 in stage 6.0 failed 1 times, most recent failure: Lost task 3.0 in stage 6.0 (TID 62, LAPTOP-H7MM9952, executor driver): org.apache.spark.SparkException: Task failed while writing rows.Pyspark. spark.SparkException: Job aborted due to stage failure: Task 0 in stage 15.0 failed 1 times, java.net.SocketException: Connection reset Hot Network Questions Does America, like non-democratic countries like China, also have factions?不知道是什么原因。. (利用 Spark-submit 提交 参数都正常). 但是 集群上的版本是1.5,和2.0都无法跑出来结果,但是1.3就能出结果, 所以目前确定是 Spark 1.5以上的版本对协同过滤算法不兼容引起,具体原因不详。. task倾斜原因比较多,网络io,cpu,mem都有可能造成 ... Aug 23, 2021 · org.apache.spark.SparkException: Job aborted due to stage failure: Total size of serialized results of 69 tasks (4.0 GB) is bigger than spark.driver.maxResultSize (4.0 GB) 08-23-2021 07:48 AM. set spark.conf.set ("spark.driver.maxResultSize", "20g") get spark.conf.get ("spark.driver.maxResultSize") // 20g which is expected in notebook , I did ... Apr 19, 2015 · org.apache.spark.SparkException: Job aborted due to stage failure: Task 7 in stage 0.0 failed 4 times, most recent failure: Lost task 7.3 in stage 0.0 (TID 11, fujitsu11.inevm.ru):java.lang.ClassNotFoundException: maven.maven1.Document java.net.URLClassLoader$1.run (URLClassLoader.java:366) java.net.URLClassLoader$1.run (URLClassLoader.java:35... hello everyone I am working on PySpark Python and I have mentioned the code and getting some issue, I am wondering if someone knows about the following issue? windowSpec = Window.partitionBy(Nov 10, 2016 · Hi! I run 2 to spark an option SPARK_MAJOR_VERSION=2 pyspark --master yarn --verbose spark starts, I run the SC and get an error, the field in the table exactly there. not the problem SPARK_MAJOR_VERSION=2 pyspark --master yarn --verbose SPARK_MAJOR_VERSION is set to 2, using Spark2 Python 2.7.12 ... SparkException: Python worker failed to connect back when execute spark action 4 Pyspark. spark.SparkException: Job aborted due to stage failure: Task 0 in stage 15.0 failed 1 times, java.net.SocketException: Connection resetat Source 'source': org.apache.spark.SparkException: Job aborted due to stage failure: Task 3 in stage 15.0 failed 1 times, most recent failure: Lost task 3.0 in stage 15.0 (TID 35, vm-85b29723, executor 1): java.nio.charset.MalformedInputException: Input length = 1org.apache.spark.SparkException: Job aborted due to stage failure: Task XXX in stage YYY failed 4 times, most recent failure: Lost task XXX in stage YYY (TID ZZZ, ip-xxx-xx-x-xxx.compute.internal, executor NNN): ExecutorLostFailure (executor NNN exited caused by one of the running tasks) Reason: ... 解決方法 理由コードの検索Caused by: org.apache.spark.SparkException: Job aborted due to stage failure: Total size of serialized results of 478 tasks (2026.0 MB) is bigger than spark.driver.maxResultSize (1024.0 MB) 当然可以通过调大spark.driver.maxResultSize的默认配置来解决问题,但如果不能从源头上解决小文件问题,以后还可能遇到 ...May 16, 2022 · Problem Databricks throws an error when fitting a SparkML model or Pipeline: org.apache.spark.SparkException: Job aborted due to stage failure: Task 0 in s Nov 28, 2019 · According to the content of README.md of GitHub repo Azure/azure-cosmosdb-spark as the figure below, you may should switch to use the latest jar file azure-cosmosdb-spark_2.4.0_2.11-1.4.0-uber.jar in it. And the maven repo for Azure CosmosDB Spark has released to 1.4.1 version, as the figure below. @Tim, actually no I have set of operations like val source_primary_key = source.map(rec => (rec.split(",")(0), rec)) source_primary_key.persist(StorageLevel.DISK_ONLY) val extra_in_source = source_primary_key.subtractByKey(destination_primary_key) var pureextinsrc = extra_in_source.count() extra_in_source.cache()and so on but before this its throwing out of memory exception while im fetching ...2 Answers. df.toPandas () collects all data to the driver node, hence it is very expensive operation. Also there is a spark property called maxResultSize. spark.driver.maxResultSize (default 1G) --> Limit of total size of serialized results of all partitions for each Spark action (e.g. collect) in bytes. Should be at least 1M, or 0 for unlimited.Nov 2, 2020 · Teams. Q&A for work. Connect and share knowledge within a single location that is structured and easy to search. Learn more about Teams Use the DF transformations to create the statistics you need, THEN call collect/show to get the result back to the driver. That way you are only downloading the stats, not the full data.SparkException:执行 spark 操作时 Python 工作线程无法连接回spark.SparkException: Python worker failed to connect back.问问题当我尝试在 pyspark 执行此命令行时from pyspark import SparkConf, SparkContext# 创建SparkConf和SparkContextconf = SparkConf().setMaster("local").setAppName("licWhen I run the demo : from pyspark.ml.linalg import Vectors import tempfile conf = SparkConf().setAppName('ansonzhou_test').setAll([ ('spark.executor.memory', '8g ...Teams. Q&A for work. Connect and share knowledge within a single location that is structured and easy to search. Learn more about TeamsSep 14, 2020 · Hi Team, I am writing a Delta file in ADL-Gen2 from ADF for multiple files dynamically using Dataflows activity. For the initial run i am able to read the file from Azure DataBricks . But when i rerun the pipeline with truncate and load i am getting… Teams. Q&A for work. Connect and share knowledge within a single location that is structured and easy to search. Learn more about Teams2 Answers. df.toPandas () collects all data to the driver node, hence it is very expensive operation. Also there is a spark property called maxResultSize. spark.driver.maxResultSize (default 1G) --> Limit of total size of serialized results of all partitions for each Spark action (e.g. collect) in bytes. Should be at least 1M, or 0 for unlimited.Caused by: org.apache.spark.SparkException: Job aborted due to stage failure: Task 6 in stage 16.0 failed 4 times, most recent failure: Lost task 6.3 in stage 16.0 (TID 478, idc-sql-dms-13, executor 40): ExecutorLostFailure (executor 40 exited caused by one of the running tasks) Reason: Container killed by YARN for exceeding memory limits. 11.8 ... Aug 20, 2018 · 报错如下: : org.apache.spark.SparkException: Job aborted due to stage failure: Task 0 in stage 3.0 failed 4 times, most recent failure: ... Viewed 6k times. 4. I'm processing large spark dataframe in databricks and when I'm trying to write the final dataframe into csv format it gives me the following error: org.apache.spark.SparkException: Job aborted. #Creating a data frame with entire date seuence for each user df=pd.DataFrame ( {'transaction_date':dt_range2,'msno':msno1}) from ...Sep 20, 2021 · I've setted up pyspark on google colab using this tutorial from towardsdatascience. It runs well until it fails on trying to use IDF from pyspark.ml.feature import IDF idf = IDF(inputCol='hash', Hi Team, I am writing a Delta file in ADL-Gen2 from ADF for multiple files dynamically using Dataflows activity. For the initial run i am able to read the file from Azure DataBricks . But when i rerun the pipeline with truncate and load i am getting…Aug 23, 2021 · org.apache.spark.SparkException: Job aborted due to stage failure: Total size of serialized results of 69 tasks (4.0 GB) is bigger than spark.driver.maxResultSize (4.0 GB) 08-23-2021 07:48 AM. set spark.conf.set ("spark.driver.maxResultSize", "20g") get spark.conf.get ("spark.driver.maxResultSize") // 20g which is expected in notebook , I did ... Jan 4, 2019 · Exception in thread "main" org.apache.spark.SparkException: Job aborted due to stage failure: Task 0 in stage 2.0 failed 1 times, most recent failure: Lost task 0.0 in stage 2.0 (TID 119, localhost, executor driver): ExecutorLostFailure (executor driver exited caused by one of the running tasks) Reason: Executor heartbeat timed out after 128839 ... Go into the cluster settings, under Advanced select spark and paste spark.driver.maxResultSize 0 (for unlimited) or whatever the value suits you. Using 0 is not recommended. You should optimize the job by re partitioning. For more details, refer "Spark Configurations - Application Properties". Hope this helps. Do let us know if you any further ...Here are some ideas to fix this error: Serializable the class. Declare the instance only within the lambda function passed in map. Make the NotSerializable object as a static and create it once per machine. Call rdd.forEachPartition and create the NotSerializable object in there like this: rdd.forEachPartition (iter -> { NotSerializable ...SparkException:执行 spark 操作时 Python 工作线程无法连接回spark.SparkException: Python worker failed to connect back.问问题当我尝试在 pyspark 执行此命令行时from pyspark import SparkConf, SparkContext# 创建SparkConf和SparkContextconf = SparkConf().setMaster("local").setAppName("licThanks for contributing an answer to Stack Overflow! Please be sure to answer the question.Provide details and share your research! But avoid …. Asking for help, clarification, or responding to other answers.Jan 3, 2022 · Based on the code , am not seeing anything wrong . Still you can analysis this issue based on the following data related . Make sure 4th line lines rdd has the data based on the collect(). Jan 24, 2022 · 1 Answer. Sorted by: 1. You need to create an RDD of type RDD [Tuple [str]] but in your code, the line: rdd = spark.sparkContext.parallelize (comments) returns RDD [str] which then fails when you try to convert it to dataframe with that given schema. Try modifying that line to: Check your data for null where not null should be present and especially on those columns that are subject of aggregation, like a reduce task, for example. In your case, it may be the id field. Your rdd is getting empty somewhere. The null pointer exception indicates that an aggregation task is attempted against of a null value. Check your data ...I am doing it using spark code. But when i try to run the code I get following exception org.apache.spark.SparkException: Job aborted due to stage failure: Task 2 in stage 1.0 failed 4 times, most recent failure: Lost task 2.3 in stage 1.0 (TID 9, XXXX.XXX.XXX.local): org.apache.spark.SparkException: Task failed while writing rows.Solve : org.apache.spark.SparkException: Job aborted due to stage failure 1 Spark Error: Executor XXX finished with state EXITED message Command exited with code 1 exitStatus 1I am trying to run a pyspark job but it is failing on RDD collectAndServe method. I do not have any memory issues. I have all updated jars in my jars folder. Python worker is crashing with below er...Solve : org.apache.spark.SparkException: Job aborted due to stage failure Load 7 more related questions Show fewer related questions 0Nov 2, 2020 · Teams. Q&A for work. Connect and share knowledge within a single location that is structured and easy to search. Learn more about Teams Stack Overflow Public questions & answers; Stack Overflow for Teams Where developers & technologists share private knowledge with coworkers; Talent Build your employer brand

1 Answer. Sorted by: 1. You need to create an RDD of type RDD [Tuple [str]] but in your code, the line: rdd = spark.sparkContext.parallelize (comments) returns RDD [str] which then fails when you try to convert it to dataframe with that given schema. Try modifying that line to:. Weather athens greece monthly

org.apache.spark.sparkexception job aborted due to stage failure

Caused by: org.apache.spark.SparkException: Job aborted due to stage failure: Aborting TaskSet 0.0 because task 0 (partition 0) cannot run anywhere due to node and executor blacklist.Jul 17, 2020 · Caused by: org.apache.spark.SparkException: Job aborted due to stage failure: Serialized task 2:0 was 155731289 bytes, which exceeds max allowed: spark.rpc.message.maxSize (134217728 bytes). Consider increasing spark.rpc.message.maxSize or using broadcast variables for large values. org.apache.spark.SparkException: **Job aborted due to stage failure: Task 0 in stage 1.0 failed 1 times, most recent failure: Lost task 0.0 in stage 1.0 (TID 1 ...Aug 26, 2018 · Exception logs: 2018-08-26 16:15:02 INFO DAGScheduler:54 - ResultStage 0 (parquet at ReadDb2HDFS.scala:288) failed in 1008.933 s due to Job aborted due to stage failure: Task 0 in stage 0.0 failed 4 times, most recent failure: Lost task 0.3 in stage 0.0 (TID 3, master, executor 4): ExecutorLostFailure (executor 4 exited caused by one of the ... org.apache.spark.SparkException: Job aborted due to stage failure: Task 1 in stage 188.0 failed 4 in Data Engineering a month ago; SparkException: There is no Credential Scope. in Data Governance a month agoAug 12, 2021 · SparkException:执行 spark 操作时 Python 工作线程无法连接回spark.SparkException: Python worker failed to connect back.问问题当我尝试在 pyspark 执行此命令行时from pyspark import SparkConf, SparkContext# 创建SparkConf和SparkContextconf = SparkConf().setMaster("local").setAppName("lic Mar 24, 2018 · Here is the full list of commands creating the list, writing it to HDFS and finally printing out the results on the console using hdfs: spark-shell. After the shell has started you type: val nums = sc.parallelize (List (1,2,3,4,5)) nums.saveAsTextFile ("/tmp/simple_list") :quit. Now we read the data from HDFS (Hadoop File System): Job aborted due to stage failure: Task 5 in stage 3.0 failed 1 times 8 Exception: Java gateway process exited before sending the driver its port number while creating a Spark Session in PythonI am trying to run a pyspark job but it is failing on RDD collectAndServe method. I do not have any memory issues. I have all updated jars in my jars folder. Python worker is crashing with below er...I installed apache-spark and pyspark on my machine (Ubuntu), and in Pycharm, I also updated the environment variables (e.g. spark_home, pyspark_python). I'm trying to do: import os, sys os.environ['hello everyone I am working on PySpark Python and I have mentioned the code and getting some issue, I am wondering if someone knows about the following issue? windowSpec = Window.partitionBy(Feb 23, 2022 · I am running spark jobs using datafactory in azure databricks. My cluster vesion is 9.1 LTS ML (includes Apache Spark 3.1.2, Scala 2.12). I am writing data on azure blob storage. While writing job ... Oct 31, 2022 · I am trying to run a pyspark job but it is failing on RDD collectAndServe method. I do not have any memory issues. I have all updated jars in my jars folder. Python worker is crashing with below er... Apr 19, 2015 · org.apache.spark.SparkException: Job aborted due to stage failure: Task 7 in stage 0.0 failed 4 times, most recent failure: Lost task 7.3 in stage 0.0 (TID 11, fujitsu11.inevm.ru):java.lang.ClassNotFoundException: maven.maven1.Document java.net.URLClassLoader$1.run (URLClassLoader.java:366) java.net.URLClassLoader$1.run (URLClassLoader.java:35... I am new to Spark and recently installed it on a mac (with Python 2.7 in the system) using homebrew: brew install apache-spark and then installed Pyspark using pip3 in my virtual environment where I have python 3.6 installed..

Popular Topics